driver compilation problem

Live forum: http://rt2x00.serialmonkey.com/viewtopic.php?t=4373

Blame

23-10-2007 07:42:42

Hello,

I have a wlan card with RT2561 chipset. But since Ubuntu Gutsy the driver isnt working anymore. So I tried to compile a new one (the rt61 from serialmonkey).
But I get an error

[code3l9l7pbo]
cd /rt61-1.1.0-b2/Module/
make all
[/code3l9l7pbo]

[code3l9l7pbo]
make[1]: Betrete Verzeichnis '/usr/src/linux-headers-2.6.22-14-generic'
CC [M] /home/blame/rt61-1.1.0-b2/Module/rtmp_data.o
/home/blame/rt61-1.1.0-b2/Module/rtmp_data.c: In Funktion »RTMPHandleRxDoneInterrupt«:
/home/blame/rt61-1.1.0-b2/Module/rtmp_data.c:477: Fehler: »struct sk_buff« hat kein Element namens »mac«
/home/blame/rt61-1.1.0-b2/Module/rtmp_data.c: In Funktion »RTMPCheckDHCPFrame«:
/home/blame/rt61-1.1.0-b2/Module/rtmp_data.c:4318: Warnung: Variable »dest_port« wird nicht verwendet
/home/blame/rt61-1.1.0-b2/Module/rtmp_data.c:4317: Warnung: Variable »is_udp« wird nicht verwendet
/home/blame/rt61-1.1.0-b2/Module/rtmp_data.c:4316: Warnung: Variable »is_ipv4« wird nicht verwendet
/home/blame/rt61-1.1.0-b2/Module/rtmp_data.c:4315: Warnung: Variable »is_ip« wird nicht verwendet
make[2]: *** [/home/blame/rt61-1.1.0-b2/Module/rtmp_data.o] Fehler 1
make[1]: *** [_module_/home/blame/rt61-1.1.0-b2/Module] Fehler 2
make[1]: Verlasse Verzeichnis '/usr/src/linux-headers-2.6.22-14-generic'
rt61.ko failed to build!
make: *** [module] Fehler 1
[/code3l9l7pbo]

The error messages are german, but I hope you can help me although.

Thanks,
Blame

IvD

23-10-2007 17:36:19

Try using latest nightly tarball instead of a beta release.